{"text_format":"1","workbook":"xlsx","n_sheets":4,"sheets":["design bordplanen","Rediger og print","Print","data"],"not_rendered":{"charts":0,"images":0,"macros":1,"external_links":0,"defined_names":1,"comments":0,"pivot_tables":0},"unopened":[],"bounds":{"document_bytes":16777216,"sheet_cells":100000,"rows_first":2000,"rows_last":500,"rows_between":2000,"halvings":0,"cell_chars":16384,"cell_head_chars":4096},"cells_cut":0,"cells_raw":0,"read":"whole","date_system":"1900"}

{"sheet":"design bordplanen","index":0,"n_rows":32,"n_cols":12,"rows_kept":32,"cut":false,"hidden":false,"merged":[[0,2,10,2],[12,2,22,2],[25,2,27,2],[0,1,10,1]]}
["Elev1","Indsæt elevnavne i kolonne A ⬇️","Lav en bordplan og indsæt numre (1,2,3,…) på de pladser, hvor der skal sidde elever. \n\nSæt en bindestreg (eller andet tegn) på tomme pladser"]
["Elev2"]
["Elev3"]
["Elev4"]
["Elev5"]
["Elev6",null,null,null,null,null,null,null,null,null,null,"TAVLE"]
["Elev7"]
["Elev8"]
["Elev9",null,null,null,null,null,null,null,null,null,null,{"$f":"IF(data!E39=\"\",\"\",data!E39)","v":""}]
["Elev10"]
["Elev11"]
["Elev12"]
["Elev13",null,"Her kan du se et eksempel på bordplanen med navne indsat tilfældigt",{"$f":"IF(D1=\"\",\"\",IF(ISNUMBER(D1),_xlfn.XLOOKUP(D1,data!$C$1:$C$32,data!$A$1:$A$32),D1))","v":""},{"$f":"IF(E1=\"\",\"\",IF(ISNUMBER(E1),_xlfn.XLOOKUP(E1,data!$C$1:$C$32,data!$A$1:$A$32),E1))","v":""},{"$f":"IF(F1=\"\",\"\",IF(ISNUMBER(F1),_xlfn.XLOOKUP(F1,data!$C$1:$C$32,data!$A$1:$A$32),F1))","v":""},{"$f":"IF(G1=\"\",\"\",IF(ISNUMBER(G1),_xlfn.XLOOKUP(G1,data!$C$1:$C$32,data!$A$1:$A$32),G1))","v":""},{"$f":"IF(H1=\"\",\"\",IF(ISNUMBER(H1),_xlfn.XLOOKUP(H1,data!$C$1:$C$32,data!$A$1:$A$32),H1))","v":""},{"$f":"IF(I1=\"\",\"\",IF(ISNUMBER(I1),_xlfn.XLOOKUP(I1,data!$C$1:$C$32,data!$A$1:$A$32),I1))","v":""},{"$f":"IF(J1=\"\",\"\",IF(ISNUMBER(J1),_xlfn.XLOOKUP(J1,data!$C$1:$C$32,data!$A$1:$A$32),J1))","v":""},{"$f":"IF(K1=\"\",\"\",IF(ISNUMBER(K1),_xlfn.XLOOKUP(K1,data!$C$1:$C$32,data!$A$1:$A$32),K1))","v":""},{"$f":"IF(L1=\"\",\"\",IF(ISNUMBER(L1),_xlfn.XLOOKUP(L1,data!$C$1:$C$32,data!$A$1:$A$32),L1))","v":""}]
["Elev14",null,null,{"$f":"IF(D2=\"\",\"\",IF(ISNUMBER(D2),_xlfn.XLOOKUP(D2,data!$C$1:$C$32,data!$A$1:$A$32),D2))","v":""},{"$f":"IF(E2=\"\",\"\",IF(ISNUMBER(E2),_xlfn.XLOOKUP(E2,data!$C$1:$C$32,data!$A$1:$A$32),E2))","v":""},{"$f":"IF(F2=\"\",\"\",IF(ISNUMBER(F2),_xlfn.XLOOKUP(F2,data!$C$1:$C$32,data!$A$1:$A$32),F2))","v":""},{"$f":"IF(G2=\"\",\"\",IF(ISNUMBER(G2),_xlfn.XLOOKUP(G2,data!$C$1:$C$32,data!$A$1:$A$32),G2))","v":""},{"$f":"IF(H2=\"\",\"\",IF(ISNUMBER(H2),_xlfn.XLOOKUP(H2,data!$C$1:$C$32,data!$A$1:$A$32),H2))","v":""},{"$f":"IF(I2=\"\",\"\",IF(ISNUMBER(I2),_xlfn.XLOOKUP(I2,data!$C$1:$C$32,data!$A$1:$A$32),I2))","v":""},{"$f":"IF(J2=\"\",\"\",IF(ISNUMBER(J2),_xlfn.XLOOKUP(J2,data!$C$1:$C$32,data!$A$1:$A$32),J2))","v":""},{"$f":"IF(K2=\"\",\"\",IF(ISNUMBER(K2),_xlfn.XLOOKUP(K2,data!$C$1:$C$32,data!$A$1:$A$32),K2))","v":""},{"$f":"IF(L2=\"\",\"\",IF(ISNUMBER(L2),_xlfn.XLOOKUP(L2,data!$C$1:$C$32,data!$A$1:$A$32),L2))","v":""}]
["Elev15",null,null,{"$f":"IF(D3=\"\",\"\",IF(ISNUMBER(D3),_xlfn.XLOOKUP(D3,data!$C$1:$C$32,data!$A$1:$A$32),D3))","v":""},{"$f":"IF(E3=\"\",\"\",IF(ISNUMBER(E3),_xlfn.XLOOKUP(E3,data!$C$1:$C$32,data!$A$1:$A$32),E3))","v":""},{"$f":"IF(F3=\"\",\"\",IF(ISNUMBER(F3),_xlfn.XLOOKUP(F3,data!$C$1:$C$32,data!$A$1:$A$32),F3))","v":""},{"$f":"IF(G3=\"\",\"\",IF(ISNUMBER(G3),_xlfn.XLOOKUP(G3,data!$C$1:$C$32,data!$A$1:$A$32),G3))","v":""},{"$f":"IF(H3=\"\",\"\",IF(ISNUMBER(H3),_xlfn.XLOOKUP(H3,data!$C$1:$C$32,data!$A$1:$A$32),H3))","v":""},{"$f":"IF(I3=\"\",\"\",IF(ISNUMBER(I3),_xlfn.XLOOKUP(I3,data!$C$1:$C$32,data!$A$1:$A$32),I3))","v":""},{"$f":"IF(J3=\"\",\"\",IF(ISNUMBER(J3),_xlfn.XLOOKUP(J3,data!$C$1:$C$32,data!$A$1:$A$32),J3))","v":""},{"$f":"IF(K3=\"\",\"\",IF(ISNUMBER(K3),_xlfn.XLOOKUP(K3,data!$C$1:$C$32,data!$A$1:$A$32),K3))","v":""},{"$f":"IF(L3=\"\",\"\",IF(ISNUMBER(L3),_xlfn.XLOOKUP(L3,data!$C$1:$C$32,data!$A$1:$A$32),L3))","v":""}]
["Elev16",null,null,{"$f":"IF(D4=\"\",\"\",IF(ISNUMBER(D4),_xlfn.XLOOKUP(D4,data!$C$1:$C$32,data!$A$1:$A$32),D4))","v":""},{"$f":"IF(E4=\"\",\"\",IF(ISNUMBER(E4),_xlfn.XLOOKUP(E4,data!$C$1:$C$32,data!$A$1:$A$32),E4))","v":""},{"$f":"IF(F4=\"\",\"\",IF(ISNUMBER(F4),_xlfn.XLOOKUP(F4,data!$C$1:$C$32,data!$A$1:$A$32),F4))","v":""},{"$f":"IF(G4=\"\",\"\",IF(ISNUMBER(G4),_xlfn.XLOOKUP(G4,data!$C$1:$C$32,data!$A$1:$A$32),G4))","v":""},{"$f":"IF(H4=\"\",\"\",IF(ISNUMBER(H4),_xlfn.XLOOKUP(H4,data!$C$1:$C$32,data!$A$1:$A$32),H4))","v":""},{"$f":"IF(I4=\"\",\"\",IF(ISNUMBER(I4),_xlfn.XLOOKUP(I4,data!$C$1:$C$32,data!$A$1:$A$32),I4))","v":""},{"$f":"IF(J4=\"\",\"\",IF(ISNUMBER(J4),_xlfn.XLOOKUP(J4,data!$C$1:$C$32,data!$A$1:$A$32),J4))","v":""},{"$f":"IF(K4=\"\",\"\",IF(ISNUMBER(K4),_xlfn.XLOOKUP(K4,data!$C$1:$C$32,data!$A$1:$A$32),K4))","v":""},{"$f":"IF(L4=\"\",\"\",IF(ISNUMBER(L4),_xlfn.XLOOKUP(L4,data!$C$1:$C$32,data!$A$1:$A$32),L4))","v":""}]
["Elev17",null,null,{"$f":"IF(D5=\"\",\"\",IF(ISNUMBER(D5),_xlfn.XLOOKUP(D5,data!$C$1:$C$32,data!$A$1:$A$32),D5))","v":""},{"$f":"IF(E5=\"\",\"\",IF(ISNUMBER(E5),_xlfn.XLOOKUP(E5,data!$C$1:$C$32,data!$A$1:$A$32),E5))","v":""},{"$f":"IF(F5=\"\",\"\",IF(ISNUMBER(F5),_xlfn.XLOOKUP(F5,data!$C$1:$C$32,data!$A$1:$A$32),F5))","v":""},{"$f":"IF(G5=\"\",\"\",IF(ISNUMBER(G5),_xlfn.XLOOKUP(G5,data!$C$1:$C$32,data!$A$1:$A$32),G5))","v":""},{"$f":"IF(H5=\"\",\"\",IF(ISNUMBER(H5),_xlfn.XLOOKUP(H5,data!$C$1:$C$32,data!$A$1:$A$32),H5))","v":""},{"$f":"IF(I5=\"\",\"\",IF(ISNUMBER(I5),_xlfn.XLOOKUP(I5,data!$C$1:$C$32,data!$A$1:$A$32),I5))","v":""},{"$f":"IF(J5=\"\",\"\",IF(ISNUMBER(J5),_xlfn.XLOOKUP(J5,data!$C$1:$C$32,data!$A$1:$A$32),J5))","v":""},{"$f":"IF(K5=\"\",\"\",IF(ISNUMBER(K5),_xlfn.XLOOKUP(K5,data!$C$1:$C$32,data!$A$1:$A$32),K5))","v":""},{"$f":"IF(L5=\"\",\"\",IF(ISNUMBER(L5),_xlfn.XLOOKUP(L5,data!$C$1:$C$32,data!$A$1:$A$32),L5))","v":""}]
["Elev18",null,null,{"$f":"IF(D6=\"\",\"\",IF(ISNUMBER(D6),_xlfn.XLOOKUP(D6,data!$C$1:$C$32,data!$A$1:$A$32),D6))","v":""},{"$f":"IF(E6=\"\",\"\",IF(ISNUMBER(E6),_xlfn.XLOOKUP(E6,data!$C$1:$C$32,data!$A$1:$A$32),E6))","v":""},{"$f":"IF(F6=\"\",\"\",IF(ISNUMBER(F6),_xlfn.XLOOKUP(F6,data!$C$1:$C$32,data!$A$1:$A$32),F6))","v":""},{"$f":"IF(G6=\"\",\"\",IF(ISNUMBER(G6),_xlfn.XLOOKUP(G6,data!$C$1:$C$32,data!$A$1:$A$32),G6))","v":""},{"$f":"IF(H6=\"\",\"\",IF(ISNUMBER(H6),_xlfn.XLOOKUP(H6,data!$C$1:$C$32,data!$A$1:$A$32),H6))","v":""},{"$f":"IF(I6=\"\",\"\",IF(ISNUMBER(I6),_xlfn.XLOOKUP(I6,data!$C$1:$C$32,data!$A$1:$A$32),I6))","v":""},{"$f":"IF(J6=\"\",\"\",IF(ISNUMBER(J6),_xlfn.XLOOKUP(J6,data!$C$1:$C$32,data!$A$1:$A$32),J6))","v":""},{"$f":"IF(K6=\"\",\"\",IF(ISNUMBER(K6),_xlfn.XLOOKUP(K6,data!$C$1:$C$32,data!$A$1:$A$32),K6))","v":""},{"$f":"IF(L6=\"\",\"\",IF(ISNUMBER(L6),_xlfn.XLOOKUP(L6,data!$C$1:$C$32,data!$A$1:$A$32),L6))","v":"TAVLE"}]
["Elev19",null,null,{"$f":"IF(D7=\"\",\"\",IF(ISNUMBER(D7),_xlfn.XLOOKUP(D7,data!$C$1:$C$32,data!$A$1:$A$32),D7))","v":""},{"$f":"IF(E7=\"\",\"\",IF(ISNUMBER(E7),_xlfn.XLOOKUP(E7,data!$C$1:$C$32,data!$A$1:$A$32),E7))","v":""},{"$f":"IF(F7=\"\",\"\",IF(ISNUMBER(F7),_xlfn.XLOOKUP(F7,data!$C$1:$C$32,data!$A$1:$A$32),F7))","v":""},{"$f":"IF(G7=\"\",\"\",IF(ISNUMBER(G7),_xlfn.XLOOKUP(G7,data!$C$1:$C$32,data!$A$1:$A$32),G7))","v":""},{"$f":"IF(H7=\"\",\"\",IF(ISNUMBER(H7),_xlfn.XLOOKUP(H7,data!$C$1:$C$32,data!$A$1:$A$32),H7))","v":""},{"$f":"IF(I7=\"\",\"\",IF(ISNUMBER(I7),_xlfn.XLOOKUP(I7,data!$C$1:$C$32,data!$A$1:$A$32),I7))","v":""},{"$f":"IF(J7=\"\",\"\",IF(ISNUMBER(J7),_xlfn.XLOOKUP(J7,data!$C$1:$C$32,data!$A$1:$A$32),J7))","v":""},{"$f":"IF(K7=\"\",\"\",IF(ISNUMBER(K7),_xlfn.XLOOKUP(K7,data!$C$1:$C$32,data!$A$1:$A$32),K7))","v":""},{"$f":"IF(L7=\"\",\"\",IF(ISNUMBER(L7),_xlfn.XLOOKUP(L7,data!$C$1:$C$32,data!$A$1:$A$32),L7))","v":""}]
["Elev20",null,null,{"$f":"IF(D8=\"\",\"\",IF(ISNUMBER(D8),_xlfn.XLOOKUP(D8,data!$C$1:$C$32,data!$A$1:$A$32),D8))","v":""},{"$f":"IF(E8=\"\",\"\",IF(ISNUMBER(E8),_xlfn.XLOOKUP(E8,data!$C$1:$C$32,data!$A$1:$A$32),E8))","v":""},{"$f":"IF(F8=\"\",\"\",IF(ISNUMBER(F8),_xlfn.XLOOKUP(F8,data!$C$1:$C$32,data!$A$1:$A$32),F8))","v":""},{"$f":"IF(G8=\"\",\"\",IF(ISNUMBER(G8),_xlfn.XLOOKUP(G8,data!$C$1:$C$32,data!$A$1:$A$32),G8))","v":""},{"$f":"IF(H8=\"\",\"\",IF(ISNUMBER(H8),_xlfn.XLOOKUP(H8,data!$C$1:$C$32,data!$A$1:$A$32),H8))","v":""},{"$f":"IF(I8=\"\",\"\",IF(ISNUMBER(I8),_xlfn.XLOOKUP(I8,data!$C$1:$C$32,data!$A$1:$A$32),I8))","v":""},{"$f":"IF(J8=\"\",\"\",IF(ISNUMBER(J8),_xlfn.XLOOKUP(J8,data!$C$1:$C$32,data!$A$1:$A$32),J8))","v":""},{"$f":"IF(K8=\"\",\"\",IF(ISNUMBER(K8),_xlfn.XLOOKUP(K8,data!$C$1:$C$32,data!$A$1:$A$32),K8))","v":""},{"$f":"IF(L8=\"\",\"\",IF(ISNUMBER(L8),_xlfn.XLOOKUP(L8,data!$C$1:$C$32,data!$A$1:$A$32),L8))","v":""}]
{"$rows_left_out":13}
{"sheet":"Rediger og print","index":1,"n_rows":12,"n_cols":20,"rows_kept":12,"cut":false,"hidden":false,"merged":[[0,0,0,9],[0,10,0,19]]}
["Rediger kun i planen her til venstre. Hvis planen til højre ikke passer, så tryk på knappen til højre"]
["","","","","","","","","","",{"$f":"IF(A2=\"\",\"\",A2)","v":""},{"$f":"IF(B2=\"\",\"\",B2)","v":""},"","","","","","","",""]
["","","","","","","","","","",{"$f":"IF(A3=\"\",\"\",A3)","v":""},{"$f":"IF(B3=\"\",\"\",B3)","v":""},{"$f":"IF(C3=\"\",\"\",C3)","v":""},{"$f":"IF(D3=\"\",\"\",D3)","v":""},{"$f":"IF(E3=\"\",\"\",E3)","v":""},{"$f":"IF(F3=\"\",\"\",F3)","v":""},{"$f":"IF(G3=\"\",\"\",G3)","v":""},{"$f":"IF(H3=\"\",\"\",H3)","v":""},{"$f":"IF(I3=\"\",\"\",I3)","v":""},{"$f":"IF(J3=\"\",\"\",J3)","v":""}]
["","","","","","","","","","","","","","","","","","","",""]
["","","","","","","","","","","","","","","","","","","",""]
["","","","","","","","","","","","","","","","","","","",""]
["","","","","","","","","TAVLE","","","","","","","","","","TAVLE",""]
["","","","","","","","","","","","","","","","","","","",""]
["","","","","","","","","","","","","","","","","","","",""]
["","","","","","","","","","","","","","","","","","","",""]
["","","","","","","","","","","","","","","","","","","",""]
["","","","","","","","","","","","","","","","","","","",""]

{"sheet":"Print","index":2,"n_rows":11,"n_cols":20,"rows_kept":11,"cut":false,"hidden":false,"merged":[]}
[{"$f":"IF('design bordplanen'!D13=\"\",\"\",'design bordplanen'!D13)","v":""},{"$f":"IF('design bordplanen'!E13=\"\",\"\",'design bordplanen'!E13)","v":""},{"$f":"IF('design bordplanen'!F13=\"\",\"\",'design bordplanen'!F13)","v":""},{"$f":"IF('design bordplanen'!G13=\"\",\"\",'design bordplanen'!G13)","v":""},{"$f":"IF('design bordplanen'!H13=\"\",\"\",'design bordplanen'!H13)","v":""},{"$f":"IF('design bordplanen'!I13=\"\",\"\",'design bordplanen'!I13)","v":""},{"$f":"IF('design bordplanen'!J13=\"\",\"\",'design bordplanen'!J13)","v":""},{"$f":"IF('design bordplanen'!K13=\"\",\"\",'design bordplanen'!K13)","v":""},{"$f":"IF('design bordplanen'!L13=\"\",\"\",'design bordplanen'!L13)","v":""},{"$f":"IF('design bordplanen'!M13=\"\",\"\",'design bordplanen'!M13)","v":""},{"$f":"IF(A1=\"\",\"\",A1)","v":""},{"$f":"IF(B1=\"\",\"\",B1)","v":""},"","","","","","","",""]
[{"$f":"IF('design bordplanen'!D14=\"\",\"\",'design bordplanen'!D14)","v":""},{"$f":"IF('design bordplanen'!E14=\"\",\"\",'design bordplanen'!E14)","v":""},{"$f":"IF('design bordplanen'!F14=\"\",\"\",'design bordplanen'!F14)","v":""},{"$f":"IF('design bordplanen'!G14=\"\",\"\",'design bordplanen'!G14)","v":""},{"$f":"IF('design bordplanen'!H14=\"\",\"\",'design bordplanen'!H14)","v":""},{"$f":"IF('design bordplanen'!I14=\"\",\"\",'design bordplanen'!I14)","v":""},{"$f":"IF('design bordplanen'!J14=\"\",\"\",'design bordplanen'!J14)","v":""},{"$f":"IF('design bordplanen'!K14=\"\",\"\",'design bordplanen'!K14)","v":""},{"$f":"IF('design bordplanen'!L14=\"\",\"\",'design bordplanen'!L14)","v":""},{"$f":"IF('design bordplanen'!M14=\"\",\"\",'design bordplanen'!M14)","v":""},{"$f":"IF(A2=\"\",\"\",A2)","v":""},{"$f":"IF(B2=\"\",\"\",B2)","v":""},{"$f":"IF(C2=\"\",\"\",C2)","v":""},{"$f":"IF(D2=\"\",\"\",D2)","v":""},{"$f":"IF(E2=\"\",\"\",E2)","v":""},{"$f":"IF(F2=\"\",\"\",F2)","v":""},{"$f":"IF(G2=\"\",\"\",G2)","v":""},{"$f":"IF(H2=\"\",\"\",H2)","v":""},{"$f":"IF(I2=\"\",\"\",I2)","v":""},{"$f":"IF(J2=\"\",\"\",J2)","v":""}]
[{"$f":"IF('design bordplanen'!D15=\"\",\"\",'design bordplanen'!D15)","v":""},{"$f":"IF('design bordplanen'!E15=\"\",\"\",'design bordplanen'!E15)","v":""},{"$f":"IF('design bordplanen'!F15=\"\",\"\",'design bordplanen'!F15)","v":""},{"$f":"IF('design bordplanen'!G15=\"\",\"\",'design bordplanen'!G15)","v":""},{"$f":"IF('design bordplanen'!H15=\"\",\"\",'design bordplanen'!H15)","v":""},{"$f":"IF('design bordplanen'!I15=\"\",\"\",'design bordplanen'!I15)","v":""},{"$f":"IF('design bordplanen'!J15=\"\",\"\",'design bordplanen'!J15)","v":""},{"$f":"IF('design bordplanen'!K15=\"\",\"\",'design bordplanen'!K15)","v":""},{"$f":"IF('design bordplanen'!L15=\"\",\"\",'design bordplanen'!L15)","v":""},{"$f":"IF('design bordplanen'!M15=\"\",\"\",'design bordplanen'!M15)","v":""},"","","","","","","","","",""]
[{"$f":"IF('design bordplanen'!D16=\"\",\"\",'design bordplanen'!D16)","v":""},{"$f":"IF('design bordplanen'!E16=\"\",\"\",'design bordplanen'!E16)","v":""},{"$f":"IF('design bordplanen'!F16=\"\",\"\",'design bordplanen'!F16)","v":""},{"$f":"IF('design bordplanen'!G16=\"\",\"\",'design bordplanen'!G16)","v":""},{"$f":"IF('design bordplanen'!H16=\"\",\"\",'design bordplanen'!H16)","v":""},{"$f":"IF('design bordplanen'!I16=\"\",\"\",'design bordplanen'!I16)","v":""},{"$f":"IF('design bordplanen'!J16=\"\",\"\",'design bordplanen'!J16)","v":""},{"$f":"IF('design bordplanen'!K16=\"\",\"\",'design bordplanen'!K16)","v":""},{"$f":"IF('design bordplanen'!L16=\"\",\"\",'design bordplanen'!L16)","v":""},{"$f":"IF('design bordplanen'!M16=\"\",\"\",'design bordplanen'!M16)","v":""},"","","","","","","","","",""]
[{"$f":"IF('design bordplanen'!D17=\"\",\"\",'design bordplanen'!D17)","v":""},{"$f":"IF('design bordplanen'!E17=\"\",\"\",'design bordplanen'!E17)","v":""},{"$f":"IF('design bordplanen'!F17=\"\",\"\",'design bordplanen'!F17)","v":""},{"$f":"IF('design bordplanen'!G17=\"\",\"\",'design bordplanen'!G17)","v":""},{"$f":"IF('design bordplanen'!H17=\"\",\"\",'design bordplanen'!H17)","v":""},{"$f":"IF('design bordplanen'!I17=\"\",\"\",'design bordplanen'!I17)","v":""},{"$f":"IF('design bordplanen'!J17=\"\",\"\",'design bordplanen'!J17)","v":""},{"$f":"IF('design bordplanen'!K17=\"\",\"\",'design bordplanen'!K17)","v":""},{"$f":"IF('design bordplanen'!L17=\"\",\"\",'design bordplanen'!L17)","v":""},{"$f":"IF('design bordplanen'!M17=\"\",\"\",'design bordplanen'!M17)","v":""},"","","","","","","","","",""]
[{"$f":"IF('design bordplanen'!D18=\"\",\"\",'design bordplanen'!D18)","v":""},{"$f":"IF('design bordplanen'!E18=\"\",\"\",'design bordplanen'!E18)","v":""},{"$f":"IF('design bordplanen'!F18=\"\",\"\",'design bordplanen'!F18)","v":""},{"$f":"IF('design bordplanen'!G18=\"\",\"\",'design bordplanen'!G18)","v":""},{"$f":"IF('design bordplanen'!H18=\"\",\"\",'design bordplanen'!H18)","v":""},{"$f":"IF('design bordplanen'!I18=\"\",\"\",'design bordplanen'!I18)","v":""},{"$f":"IF('design bordplanen'!J18=\"\",\"\",'design bordplanen'!J18)","v":""},{"$f":"IF('design bordplanen'!K18=\"\",\"\",'design bordplanen'!K18)","v":""},{"$f":"IF('design bordplanen'!L18=\"\",\"\",'design bordplanen'!L18)","v":"TAVLE"},{"$f":"IF('design bordplanen'!M18=\"\",\"\",'design bordplanen'!M18)","v":""},"","","","","","","","","TAVLE",""]
[{"$f":"IF('design bordplanen'!D19=\"\",\"\",'design bordplanen'!D19)","v":""},{"$f":"IF('design bordplanen'!E19=\"\",\"\",'design bordplanen'!E19)","v":""},{"$f":"IF('design bordplanen'!F19=\"\",\"\",'design bordplanen'!F19)","v":""},{"$f":"IF('design bordplanen'!G19=\"\",\"\",'design bordplanen'!G19)","v":""},{"$f":"IF('design bordplanen'!H19=\"\",\"\",'design bordplanen'!H19)","v":""},{"$f":"IF('design bordplanen'!I19=\"\",\"\",'design bordplanen'!I19)","v":""},{"$f":"IF('design bordplanen'!J19=\"\",\"\",'design bordplanen'!J19)","v":""},{"$f":"IF('design bordplanen'!K19=\"\",\"\",'design bordplanen'!K19)","v":""},{"$f":"IF('design bordplanen'!L19=\"\",\"\",'design bordplanen'!L19)","v":""},{"$f":"IF('design bordplanen'!M19=\"\",\"\",'design bordplanen'!M19)","v":""},"","","","","","","","","",""]
[{"$f":"IF('design bordplanen'!D20=\"\",\"\",'design bordplanen'!D20)","v":""},{"$f":"IF('design bordplanen'!E20=\"\",\"\",'design bordplanen'!E20)","v":""},{"$f":"IF('design bordplanen'!F20=\"\",\"\",'design bordplanen'!F20)","v":""},{"$f":"IF('design bordplanen'!G20=\"\",\"\",'design bordplanen'!G20)","v":""},{"$f":"IF('design bordplanen'!H20=\"\",\"\",'design bordplanen'!H20)","v":""},{"$f":"IF('design bordplanen'!I20=\"\",\"\",'design bordplanen'!I20)","v":""},{"$f":"IF('design bordplanen'!J20=\"\",\"\",'design bordplanen'!J20)","v":""},{"$f":"IF('design bordplanen'!K20=\"\",\"\",'design bordplanen'!K20)","v":""},{"$f":"IF('design bordplanen'!L20=\"\",\"\",'design bordplanen'!L20)","v":""},{"$f":"IF('design bordplanen'!M20=\"\",\"\",'design bordplanen'!M20)","v":""},"","","","","","","","","",""]
[{"$f":"IF('design bordplanen'!D21=\"\",\"\",'design bordplanen'!D21)","v":""},{"$f":"IF('design bordplanen'!E21=\"\",\"\",'design bordplanen'!E21)","v":""},{"$f":"IF('design bordplanen'!F21=\"\",\"\",'design bordplanen'!F21)","v":""},{"$f":"IF('design bordplanen'!G21=\"\",\"\",'design bordplanen'!G21)","v":""},{"$f":"IF('design bordplanen'!H21=\"\",\"\",'design bordplanen'!H21)","v":""},{"$f":"IF('design bordplanen'!I21=\"\",\"\",'design bordplanen'!I21)","v":""},{"$f":"IF('design bordplanen'!J21=\"\",\"\",'design bordplanen'!J21)","v":""},{"$f":"IF('design bordplanen'!K21=\"\",\"\",'design bordplanen'!K21)","v":""},{"$f":"IF('design bordplanen'!L21=\"\",\"\",'design bordplanen'!L21)","v":""},{"$f":"IF('design bordplanen'!M21=\"\",\"\",'design bordplanen'!M21)","v":""},"","","","","","","","","",""]
[{"$f":"IF('design bordplanen'!D22=\"\",\"\",'design bordplanen'!D22)","v":""},{"$f":"IF('design bordplanen'!E22=\"\",\"\",'design bordplanen'!E22)","v":""},{"$f":"IF('design bordplanen'!F22=\"\",\"\",'design bordplanen'!F22)","v":""},{"$f":"IF('design bordplanen'!G22=\"\",\"\",'design bordplanen'!G22)","v":""},{"$f":"IF('design bordplanen'!H22=\"\",\"\",'design bordplanen'!H22)","v":""},{"$f":"IF('design bordplanen'!I22=\"\",\"\",'design bordplanen'!I22)","v":""},{"$f":"IF('design bordplanen'!J22=\"\",\"\",'design bordplanen'!J22)","v":""},{"$f":"IF('design bordplanen'!K22=\"\",\"\",'design bordplanen'!K22)","v":""},{"$f":"IF('design bordplanen'!L22=\"\",\"\",'design bordplanen'!L22)","v":""},{"$f":"IF('design bordplanen'!M22=\"\",\"\",'design bordplanen'!M22)","v":""},"","","","","","","","","",""]
[{"$f":"IF('design bordplanen'!D23=\"\",\"\",'design bordplanen'!D23)","v":""},{"$f":"IF('design bordplanen'!E23=\"\",\"\",'design bordplanen'!E23)","v":""},{"$f":"IF('design bordplanen'!F23=\"\",\"\",'design bordplanen'!F23)","v":""},{"$f":"IF('design bordplanen'!G23=\"\",\"\",'design bordplanen'!G23)","v":""},{"$f":"IF('design bordplanen'!H23=\"\",\"\",'design bordplanen'!H23)","v":""},{"$f":"IF('design bordplanen'!I23=\"\",\"\",'design bordplanen'!I23)","v":""},{"$f":"IF('design bordplanen'!J23=\"\",\"\",'design bordplanen'!J23)","v":""},{"$f":"IF('design bordplanen'!K23=\"\",\"\",'design bordplanen'!K23)","v":""},{"$f":"IF('design bordplanen'!L23=\"\",\"\",'design bordplanen'!L23)","v":""},{"$f":"IF('design bordplanen'!M23=\"\",\"\",'design bordplanen'!M23)","v":""},"","","","","","","","","",""]

{"sheet":"data","index":3,"n_rows":32,"n_cols":5,"rows_kept":32,"cut":false,"hidden":false,"merged":[]}
[{"$f":"IF('design bordplanen'!A1=\"\",\"\",'design bordplanen'!A1)","v":"Elev1"},{"$f":"IF(A1=\"\",\"\",RAND())","v":0.33147873231892755},{"$f":"IF(B1=\"\",\"\",RANK(B1,$B$1:$B$32))","v":22},{"$f":"IF(C1=\"\",\"\",ROWS(C$1:C1))","v":1},{"$f":"IF(D1=\"\",\"\",_xlfn.XLOOKUP(D1,$C$1:$C$26,$A$1:$A$26))","v":"Elev8"}]
[{"$f":"IF('design bordplanen'!A2=\"\",\"\",'design bordplanen'!A2)","v":"Elev2"},0.45484803859237133,20,{"$f":"IF(C2=\"\",\"\",ROWS(C$1:C2))","v":2},"Elev15"]
[{"$f":"IF('design bordplanen'!A3=\"\",\"\",'design bordplanen'!A3)","v":"Elev3"},0.71907623656992437,7,{"$f":"IF(C3=\"\",\"\",ROWS(C$1:C3))","v":3},"Elev12"]
[{"$f":"IF('design bordplanen'!A4=\"\",\"\",'design bordplanen'!A4)","v":"Elev4"},0.20963463664573145,26,{"$f":"IF(C4=\"\",\"\",ROWS(C$1:C4))","v":4},{"$error":"#N/A"}]
[{"$f":"IF('design bordplanen'!A5=\"\",\"\",'design bordplanen'!A5)","v":"Elev5"},5.8068216821893226E-2,32,{"$f":"IF(C5=\"\",\"\",ROWS(C$1:C5))","v":5},"Elev21"]
[{"$f":"IF('design bordplanen'!A6=\"\",\"\",'design bordplanen'!A6)","v":"Elev6"},0.46047698966570239,19,{"$f":"IF(C6=\"\",\"\",ROWS(C$1:C6))","v":6},{"$error":"#N/A"}]
[{"$f":"IF('design bordplanen'!A7=\"\",\"\",'design bordplanen'!A7)","v":"Elev7"},0.20425652733687027,27,{"$f":"IF(C7=\"\",\"\",ROWS(C$1:C7))","v":7},"Elev3"]
[{"$f":"IF('design bordplanen'!A8=\"\",\"\",'design bordplanen'!A8)","v":"Elev8"},0.99476634367050942,1,{"$f":"IF(C8=\"\",\"\",ROWS(C$1:C8))","v":8},"Elev18"]
[{"$f":"IF('design bordplanen'!A9=\"\",\"\",'design bordplanen'!A9)","v":"Elev9"},0.60275597945213244,12,{"$f":"IF(C9=\"\",\"\",ROWS(C$1:C9))","v":9},"Elev25"]
[{"$f":"IF('design bordplanen'!A10=\"\",\"\",'design bordplanen'!A10)","v":"Elev10"},0.2434352847431932,24,{"$f":"IF(C10=\"\",\"\",ROWS(C$1:C10))","v":10},{"$error":"#N/A"}]
[{"$f":"IF('design bordplanen'!A11=\"\",\"\",'design bordplanen'!A11)","v":"Elev11"},0.46117919561551746,18,{"$f":"IF(C11=\"\",\"\",ROWS(C$1:C11))","v":11},"Elev14"]
[{"$f":"IF('design bordplanen'!A12=\"\",\"\",'design bordplanen'!A12)","v":"Elev12"},0.9307179084568622,3,{"$f":"IF(C12=\"\",\"\",ROWS(C$1:C12))","v":12},"Elev9"]
[{"$f":"IF('design bordplanen'!A13=\"\",\"\",'design bordplanen'!A13)","v":"Elev13"},0.18431233122925039,30,{"$f":"IF(C13=\"\",\"\",ROWS(C$1:C13))","v":13},{"$error":"#N/A"}]
[{"$f":"IF('design bordplanen'!A14=\"\",\"\",'design bordplanen'!A14)","v":"Elev14"},0.61593622879370435,11,{"$f":"IF(C14=\"\",\"\",ROWS(C$1:C14))","v":14},"Elev17"]
[{"$f":"IF('design bordplanen'!A15=\"\",\"\",'design bordplanen'!A15)","v":"Elev15"},0.95504800038339011,2,{"$f":"IF(C15=\"\",\"\",ROWS(C$1:C15))","v":15},"Elev24"]
[{"$f":"IF('design bordplanen'!A16=\"\",\"\",'design bordplanen'!A16)","v":"Elev16"},0.51206116461207174,16,{"$f":"IF(C16=\"\",\"\",ROWS(C$1:C16))","v":16},"Elev16"]
[{"$f":"IF('design bordplanen'!A17=\"\",\"\",'design bordplanen'!A17)","v":"Elev17"},0.54931473274329345,14,{"$f":"IF(C17=\"\",\"\",ROWS(C$1:C17))","v":17},{"$error":"#N/A"}]
[{"$f":"IF('design bordplanen'!A18=\"\",\"\",'design bordplanen'!A18)","v":"Elev18"},0.69036267240495697,8,{"$f":"IF(C18=\"\",\"\",ROWS(C$1:C18))","v":18},"Elev11"]
[{"$f":"IF('design bordplanen'!A19=\"\",\"\",'design bordplanen'!A19)","v":"Elev19"},0.11089049733610845,31,{"$f":"IF(C19=\"\",\"\",ROWS(C$1:C19))","v":19},"Elev6"]
[{"$f":"IF('design bordplanen'!A20=\"\",\"\",'design bordplanen'!A20)","v":"Elev20"},0.29298136268531394,23,{"$f":"IF(C20=\"\",\"\",ROWS(C$1:C20))","v":20},"Elev2"]
{"$rows_left_out":12}